Reaction Details
TargetLiver carboxylesterase
LigandBDBM50300581
Substrate/Competitorn/a
Meas. Tech.ChEMBL_588965 (CHEMBL1056160)
Ki 3330±n/a nM
Citation Makhaeva, GFAksinenko, AYSokolov, VBSerebryakova, OGRichardson, RJ Synthesis of organophosphates with fluorine-containing leaving groups as serine esterase inhibitors with potential for Alzheimer disease therapeutics. Bioorg Med Chem Lett19:5528-30 (2009) 
 
Liver carboxylesterase
Name:Liver carboxylesterase
Type:PROTEIN
Mol. Mass.:62009.98
Organism:Sus scrofa
Description:ChEMBL_427761
Residue:566
BDBM50300581
NameBDBM50300581
Synonyms:CHEMBL575301 | Diethyl 2,2,2-trifluoro-1-phenylethyl phosphate
TypeSmall organic molecule
Emp. Form.C12H16F3O4P
Mol. Mass.312.222
SMILESCCOP(=O)(OCC)OC(c1ccccc1)C(F)(F)F