Reaction Details
TargetCysteine protease
LigandBDBM50300774
Substrate/Competitorn/a
Meas. Tech.ChEMBL_591545 (CHEMBL1062951)
IC50 400±n/a nM
Citation Mallari, JPShelat, AAKosinski, ACaffrey, CRConnelly, MZhu, FMcKerrow, JHGuy, RK Structure-guided development of selective TbcatB inhibitors. J Med Chem52:6489-93 (2009) 
 
Cysteine protease
Name:Cysteine protease
Synonyms:Rhodesain
Type:PROTEIN
Mol. Mass.:48425.78
Organism:Trypanosoma brucei rhodesiense
Description:ChEMBL_619861
Residue:450
BDBM50300774
NameBDBM50300774
TypeSmall organic molecule
Emp. Form.C24H23N7O2
Mol. Mass.441.4851
SMILESCC(=O)Nc1cccc(c1)-c1cccc(CNc2nc(nc3n(CCCO)cnc23)C#N)c1