Reaction Details
TargetCysteine protease
LigandBDBM50300779
Substrate/Competitorn/a
Meas. Tech.ChEMBL_591545 (CHEMBL1062951)
IC50>15000±n/a nM
Citation Mallari, JPShelat, AAKosinski, ACaffrey, CRConnelly, MZhu, FMcKerrow, JHGuy, RK Structure-guided development of selective TbcatB inhibitors. J Med Chem52:6489-93 (2009) 
 
Cysteine protease
Name:Cysteine protease
Synonyms:Rhodesain
Type:PROTEIN
Mol. Mass.:48425.78
Organism:Trypanosoma brucei rhodesiense
Description:ChEMBL_619861
Residue:450
BDBM50300779
NameBDBM50300779
TypeSmall organic molecule
Emp. Form.C25H26N6O
Mol. Mass.426.5135
SMILESCC(C)c1ccccc1-c1cccc(CNc2nc(nc3n(CCCO)cnc23)C#N)c1