Reaction Details
TargetProcathepsin L
LigandBDBM50268500
Substrate/Competitorn/a
Meas. Tech.ChEMBL_591546 (CHEMBL1062952)
IC50 1100±n/a nM
Citation Mallari, JPShelat, AAKosinski, ACaffrey, CRConnelly, MZhu, FMcKerrow, JHGuy, RK Structure-guided development of selective TbcatB inhibitors. J Med Chem52:6489-93 (2009) 
 
Procathepsin L
Name:Procathepsin L
Type:Enzyme
Mol. Mass.:37557.19
Organism:Homo sapiens (Human)
Description:Purchased from Calbiochem (San Diego, CA).
Residue:333
BDBM50268500
NameBDBM50268500
Synonyms:1-butyl-4-(2-(4'-ethylbiphenyl-3-yl)ethyl)-6-ethynyl-1H-indene CHEMBL524075
TypeSmall organic molecule
Emp. Form.C23H22N6O2
Mol. Mass.414.4598
SMILESCOc1ccc(cc1)-c1cccc(CNc2nc(nc3n(CCCO)cnc23)C#N)c1