Reaction Details
TargetProcathepsin L
LigandBDBM50268620
Substrate/Competitorn/a
Meas. Tech.ChEMBL_591546 (CHEMBL1062952)
IC50 1300±n/a nM
Citation Mallari, JPShelat, AAKosinski, ACaffrey, CRConnelly, MZhu, FMcKerrow, JHGuy, RK Structure-guided development of selective TbcatB inhibitors. J Med Chem52:6489-93 (2009) 
 
Procathepsin L
Name:Procathepsin L
Type:Enzyme
Mol. Mass.:37557.19
Organism:Homo sapiens (Human)
Description:Purchased from Calbiochem (San Diego, CA).
Residue:333
BDBM50268620
NameBDBM50268620
Synonyms:6-((3'-bromo-2'-isopropoxybiphenyl-3-yl)methylamino)-9-(3-hydroxypropyl)-9H-purine-2-carbonitrile | CHEMBL497620
TypeSmall organic molecule
Emp. Form.C25H25BrN6O2
Mol. Mass.521.409
SMILESCC(C)Oc1c(Br)cccc1-c1cccc(CNc2nc(nc3n(CCCO)cnc23)C#N)c1