Reaction Details
TargetProcathepsin L
LigandBDBM50300785
Substrate/Competitorn/a
Meas. Tech.ChEMBL_591546 (CHEMBL1062952)
IC50 1500±n/a nM
Citation Mallari, JPShelat, AAKosinski, ACaffrey, CRConnelly, MZhu, FMcKerrow, JHGuy, RK Structure-guided development of selective TbcatB inhibitors. J Med Chem52:6489-93 (2009) 
 
Procathepsin L
Name:Procathepsin L
Type:Enzyme
Mol. Mass.:37557.19
Organism:Homo sapiens (Human)
Description:Purchased from Calbiochem (San Diego, CA).
Residue:333
BDBM50300785
NameBDBM50300785
Synonyms:9-(3-hydroxypropyl)-6-((2'-(trifluoromethyl)biphenyl-3-yl)methylamino)-9H-purine-2-carbonitrile | CHEMBL571711
TypeSmall organic molecule
Emp. Form.C23H19F3N6O
Mol. Mass.452.4318
SMILESOCCCn1cnc2c(NCc3cccc(c3)-c3ccccc3C(F)(F)F)nc(nc12)C#N