Reaction Details
TargetProcathepsin L
LigandBDBM50268616
Substrate/Competitorn/a
Meas. Tech.ChEMBL_591546 (CHEMBL1062952)
IC50 1600±n/a nM
Citation Mallari, JPShelat, AAKosinski, ACaffrey, CRConnelly, MZhu, FMcKerrow, JHGuy, RK Structure-guided development of selective TbcatB inhibitors. J Med Chem52:6489-93 (2009) 
 
Procathepsin L
Name:Procathepsin L
Type:Enzyme
Mol. Mass.:37557.19
Organism:Homo sapiens (Human)
Description:Purchased from Calbiochem (San Diego, CA).
Residue:333
BDBM50268616
NameBDBM50268616
Synonyms:9-(3-hydroxypropyl)-6-(3-(pyridin-3-yl)benzylamino)-9H-purine-2-carbonitrile | CHEMBL524810
TypeSmall organic molecule
Emp. Form.C21H19N7O
Mol. Mass.385.4219
SMILESOCCCn1cnc2c(NCc3cccc(c3)-c3cccnc3)nc(nc12)C#N