Reaction Details
TargetProto-oncogene tyrosine-protein kinase Src
LigandBDBM50301009
Substrate/Competitorn/a
Meas. Tech.ChEMBL_598136 (CHEMBL1039166)
IC50 2.9±n/a nM
Citation Zhang, NWu, BBoschelli, DHGolas, JMBoschelli, F 4-Anilino-7-pyridyl-3-quinolinecarbonitriles as Src kinase inhibitors. Bioorg Med Chem Lett19:5071-4 (2009) 
 
Proto-oncogene tyrosine-protein kinase Src
Name:Proto-oncogene tyrosine-protein kinase Src
Type:Protein
Mol. Mass.:59838.60
Organism:Homo sapiens (Human)
Description:P12931
Residue:536
BDBM50301009
NameBDBM50301009
Synonyms:4-(2,4-dichloro-5-methoxyphenylamino)-7-(5-(morpholinomethyl)pyridin-2-yl)quinoline-3-carbonitrile | CHEMBL584915
TypeSmall organic molecule
Emp. Form.C27H23Cl2N5O2
Mol. Mass.520.41
SMILESCOc1cc(Nc2c(cnc3cc(ccc23)-c2ccc(CN3CCOCC3)cn2)C#N)c(Cl)cc1Cl