Reaction Details
TargetProto-oncogene tyrosine-protein kinase Src
LigandBDBM50301016
Substrate/Competitorn/a
Meas. Tech.ChEMBL_598136 (CHEMBL1039166)
IC50 1.8±n/a nM
Citation Zhang, NWu, BBoschelli, DHGolas, JMBoschelli, F 4-Anilino-7-pyridyl-3-quinolinecarbonitriles as Src kinase inhibitors. Bioorg Med Chem Lett19:5071-4 (2009) 
 
Proto-oncogene tyrosine-protein kinase Src
Name:Proto-oncogene tyrosine-protein kinase Src
Type:Protein
Mol. Mass.:59838.60
Organism:Homo sapiens (Human)
Description:P12931
Residue:536
BDBM50301016
NameBDBM50301016
Synonyms:4-(2,4-Dichloro-5-methoxy-phenylamino)-7-[5-(1,1-dioxo-1lambda*6*-thiomorpholin-4-ylmethyl)-pyridin-2-yl]quinoline-3-carbonitrile | CHEMBL585198
TypeSmall organic molecule
Emp. Form.C27H23Cl2N5O3S
Mol. Mass.568.474
SMILESCOc1cc(Nc2c(cnc3cc(ccc23)-c2ccc(CN3CCS(=O)(=O)CC3)cn2)C#N)c(Cl)cc1Cl