Reaction Details
TargetMelanin-concentrating hormone receptor 1
LigandBDBM50301099
Substrate/Competitorn/a
Meas. Tech.ChEMBL_598541 (CHEMBL1043533)
IC50 11±n/a nM
Citation Ando, MSekino, EHaga, YMoriya, MIto, MIto, JIwaasa, HIshihara, AKanatani, AOhtake, N Discovery of novel phenethylpyridone derivatives as potent melanin-concentrating hormone 1 receptor antagonists. Bioorg Med Chem Lett19:5186-90 (2009) 
 
Melanin-concentrating hormone receptor 1
Name:Melanin-concentrating hormone receptor 1
Type:G Protein-Coupled Receptor (GPCR)
Mol. Mass.:45976.27
Organism:Homo sapiens (Human)
Description:Membranes from CHO-K1 cells stably expressing human MCH1R were used in assays.
Residue:422
BDBM50301099
NameBDBM50301099
Synonyms:4-(4-fluorobenzyloxy)-1-(2-(6-((propylamino)methyl)pyridin-3-yl)ethyl)pyridin-2(1H)-one | CHEMBL565834
TypeSmall organic molecule
Emp. Form.C23H26FN3O2
Mol. Mass.395.4698
SMILESCCCNCc1ccc(CCn2ccc(OCc3ccc(F)cc3)cc2=O)cn1