Reaction Details
TargetHistamine H3 receptor
LigandBDBM50301095
Substrate/Competitorn/a
Meas. Tech.ChEMBL_598549 (CHEMBL1043541)
IC50>5000±n/a nM
Citation Ando, MSekino, EHaga, YMoriya, MIto, MIto, JIwaasa, HIshihara, AKanatani, AOhtake, N Discovery of novel phenethylpyridone derivatives as potent melanin-concentrating hormone 1 receptor antagonists. Bioorg Med Chem Lett19:5186-90 (2009) 
 
Histamine H3 receptor
Name:Histamine H3 receptor
Type:G Protein-Coupled Receptor (GPCR)
Mol. Mass.:48691.47
Organism:Homo sapiens (Human)
Description:Binding assays were using CHO cells stably expressing hH3R receptors.
Residue:445
BDBM50301095
NameBDBM50301095
Synonyms:4-(4-fluorobenzyloxy)-1-(4-((propylamino)methyl)phenethyl)pyridin-2(1H)-one | CHEMBL570296
TypeSmall organic molecule
Emp. Form.C24H27FN2O2
Mol. Mass.394.4818
SMILESCCCNCc1ccc(CCn2ccc(OCc3ccc(F)cc3)cc2=O)cc1