Reaction Details
TargetTransporter
LigandBDBM50301211
Substrate/Competitorn/a
Meas. Tech.ChEMBL_598777 (CHEMBL1042017)
Ki 8.4±n/a nM
Citation Jobson, NKCrawford, ARDewar, DPimlott, SLSutherland, A Design and synthesis of (2R,3S)-iodoreboxetine analogues for SPECT imaging of the noradrenaline transporter. Bioorg Med Chem Lett19:4996-8 (2009) 
 
Transporter
Name:Transporter
Type:Multi-pass membrane protein
Mol. Mass.:69236.90
Organism:Rattus norvegicus (rat)
Description:Q63380
Residue:617
BDBM50301211
NameBDBM50301211
Synonyms:(2R,3S)-2-[(2-Iodophenoxy)phenylmethyl]morpholine | CHEMBL568336
TypeSmall organic molecule
Emp. Form.C17H18INO2
Mol. Mass.395.2348
SMILESIc1ccccc1O[C@H]([C@H]1CNCCO1)c1ccccc1