Reaction Details
TargetBeta-secretase 1
LigandBDBM50301215
Substrate/Competitorn/a
Meas. Tech.ChEMBL_598828 (CHEMBL1044660)
IC50 3200±n/a nM
Citation Hills, IDHolloway, MKde León, PNomland, AZhu, HRajapakse, HAllison, TJMunshi, SKColussi, DPietrak, BLToolan, DHaugabook, SJGraham, SLStachel, SJ A conformational constraint improves a beta-secretase inhibitor but for an unexpected reason. Bioorg Med Chem Lett19:4993-5 (2009) 
 
Beta-secretase 1
Name:Beta-secretase 1
Type:Protein
Mol. Mass.:55755.10
Organism:Homo sapiens (Human)
Description:P56817
Residue:501
BDBM50301215
NameBDBM50301215
Synonyms:4-(5-methoxy-1-(2-methoxy-5-nitrobenzyl)-2,3,3a,7a-tetrahydro-1H-inden-1-yl)-1-methyl-1H-imidazol-2-amine | CHEMBL568557
TypeSmall organic molecule
Emp. Form.C22H26N4O4
Mol. Mass.410.4662
SMILESCOC1=CC2CCC(Cc3cc(ccc3OC)[N+]([O-])=O)(C2C=C1)c1cn(C)c(N)n1