Reaction Details
TargetCarboxypeptidase A1
LigandBDBM50301280
Substrate/Competitorn/a
Meas. Tech.ChEMBL_599273 (CHEMBL1041001)
Ki 15000±n/a nM
Citation Wang, SFTian, GRZhang, WZJin, JY Characterization of alpha-nitromethyl ketone as a new zinc-binding group based on structural analysis of its complex with carboxypeptidase A. Bioorg Med Chem Lett19:5009-11 (2009) 
 
Carboxypeptidase A1
Name:Carboxypeptidase A1
Type:PROTEIN
Mol. Mass.:47132.61
Organism:Homo sapiens (Human)
Description:ChEMBL_1496378
Residue:419
BDBM50301280
NameBDBM50301280
Synonyms:(+/-)-2-benzyl-5-bromo-4-oxopentanoic acid | CHEMBL571255
TypeSmall organic molecule
Emp. Form.C12H13BrO3
Mol. Mass.285.134
SMILESOC(=O)C(CC(=O)CBr)Cc1ccccc1