Reaction Details
Target5-hydroxytryptamine receptor 2A
LigandBDBM50301500
Substrate/Competitorn/a
Meas. Tech.ChEMBL_600346 (CHEMBL1041064)
Ki 0.91±n/a nM
Citation Dosa, PIStrah-Pleynet, SJayakumar, HCasper, MDecaire, MXiong, YLehmann, JChoi, KElwell, KWong, AWebb, RRAdams, JWRamirez, JRichman, JGThomsen, WSemple, GTeegarden, BR Solubilized phenyl-pyrazole ureas as potent, selective 5-HT(2A) inverse-agonists and their application as antiplatelet agents. Bioorg Med Chem Lett19:5486-9 (2009) 
 
5-hydroxytryptamine receptor 2A
Name:5-hydroxytryptamine receptor 2A
Type:undefined
Mol. Mass.:52607.65
Organism:Homo sapiens (Human)
Description:P28223
Residue:471
BDBM50301500
NameBDBM50301500
Synonyms:1-(3,5-difluorophenyl)-3-(3-(1-methyl-1H-pyrazol-5-yl)-4-(2-(piperidin-1-yl)ethoxy)phenyl)urea | CHEMBL585142
TypeSmall organic molecule
Emp. Form.C24H27F2N5O2
Mol. Mass.455.5003
SMILESCn1nccc1-c1cc(NC(=O)Nc2cc(F)cc(F)c2)ccc1OCCN1CCCCC1