Reaction Details
Target5-hydroxytryptamine receptor 2C
LigandBDBM50301480
Substrate/Competitorn/a
Meas. Tech.ChEMBL_600347 (CHEMBL1041065)
Ki 66.2±n/a nM
Citation Dosa, PIStrah-Pleynet, SJayakumar, HCasper, MDecaire, MXiong, YLehmann, JChoi, KElwell, KWong, AWebb, RRAdams, JWRamirez, JRichman, JGThomsen, WSemple, GTeegarden, BR Solubilized phenyl-pyrazole ureas as potent, selective 5-HT(2A) inverse-agonists and their application as antiplatelet agents. Bioorg Med Chem Lett19:5486-9 (2009) 
 
5-hydroxytryptamine receptor 2C
Name:5-hydroxytryptamine receptor 2C
Type:G Protein-Coupled Receptor (GPCR)
Mol. Mass.:51836.79
Organism:Homo sapiens (Human)
Description:P28335
Residue:458
BDBM50301480
NameBDBM50301480
Synonyms:1-(4-chlorophenyl)-3-(4-(2-(4-hydroxypiperidin-1-yl)ethoxy)-3-(1-methyl-1H-pyrazol-5-yl)phenyl)urea | CHEMBL567246
TypeSmall organic molecule
Emp. Form.C24H28ClN5O3
Mol. Mass.469.964
SMILESCn1nccc1-c1cc(NC(=O)Nc2ccc(Cl)cc2)ccc1OCCN1CCC(O)CC1