Reaction Details
Target5-hydroxytryptamine receptor 2C
LigandBDBM50301486
Substrate/Competitorn/a
Meas. Tech.ChEMBL_600347 (CHEMBL1041065)
Ki 1090±n/a nM
Citation Dosa, PIStrah-Pleynet, SJayakumar, HCasper, MDecaire, MXiong, YLehmann, JChoi, KElwell, KWong, AWebb, RRAdams, JWRamirez, JRichman, JGThomsen, WSemple, GTeegarden, BR Solubilized phenyl-pyrazole ureas as potent, selective 5-HT(2A) inverse-agonists and their application as antiplatelet agents. Bioorg Med Chem Lett19:5486-9 (2009) 
 
5-hydroxytryptamine receptor 2C
Name:5-hydroxytryptamine receptor 2C
Type:G Protein-Coupled Receptor (GPCR)
Mol. Mass.:51836.79
Organism:Homo sapiens (Human)
Description:P28335
Residue:458
BDBM50301486
NameBDBM50301486
Synonyms:1-(3-(1-methyl-1H-pyrazol-5-yl)-4-(2-(piperidin-1-yl)ethoxy)phenyl)-3-phenylurea | CHEMBL565525
TypeSmall organic molecule
Emp. Form.C24H29N5O2
Mol. Mass.419.5194
SMILESCn1nccc1-c1cc(NC(=O)Nc2ccccc2)ccc1OCCN1CCCCC1