Reaction Details
Target5-hydroxytryptamine receptor 2C
LigandBDBM50301494
Substrate/Competitorn/a
Meas. Tech.ChEMBL_600347 (CHEMBL1041065)
Ki 385±n/a nM
Citation Dosa, PIStrah-Pleynet, SJayakumar, HCasper, MDecaire, MXiong, YLehmann, JChoi, KElwell, KWong, AWebb, RRAdams, JWRamirez, JRichman, JGThomsen, WSemple, GTeegarden, BR Solubilized phenyl-pyrazole ureas as potent, selective 5-HT(2A) inverse-agonists and their application as antiplatelet agents. Bioorg Med Chem Lett19:5486-9 (2009) 
 
5-hydroxytryptamine receptor 2C
Name:5-hydroxytryptamine receptor 2C
Type:G Protein-Coupled Receptor (GPCR)
Mol. Mass.:51836.79
Organism:Homo sapiens (Human)
Description:P28335
Residue:458
BDBM50301494
NameBDBM50301494
Synonyms:1-(4-methoxyphenyl)-3-(3-(1-methyl-1H-pyrazol-5-yl)-4-(2-(piperidin-1-yl)ethoxy)phenyl)urea | CHEMBL568314
TypeSmall organic molecule
Emp. Form.C25H31N5O3
Mol. Mass.449.5453
SMILESCOc1ccc(NC(=O)Nc2ccc(OCCN3CCCCC3)c(c2)-c2ccnn2C)cc1