Reaction Details
Target5-hydroxytryptamine receptor 2C
LigandBDBM50301495
Substrate/Competitorn/a
Meas. Tech.ChEMBL_600347 (CHEMBL1041065)
Ki 2.9±n/a nM
Citation Dosa, PIStrah-Pleynet, SJayakumar, HCasper, MDecaire, MXiong, YLehmann, JChoi, KElwell, KWong, AWebb, RRAdams, JWRamirez, JRichman, JGThomsen, WSemple, GTeegarden, BR Solubilized phenyl-pyrazole ureas as potent, selective 5-HT(2A) inverse-agonists and their application as antiplatelet agents. Bioorg Med Chem Lett19:5486-9 (2009) 
 
5-hydroxytryptamine receptor 2C
Name:5-hydroxytryptamine receptor 2C
Type:G Protein-Coupled Receptor (GPCR)
Mol. Mass.:51836.79
Organism:Homo sapiens (Human)
Description:P28335
Residue:458
BDBM50301495
NameBDBM50301495
Synonyms:1-(3-(1-methyl-1H-pyrazol-5-yl)-4-(2-(piperidin-1-yl)ethoxy)phenyl)-3-(3-(trifluoromethyl)phenyl)urea | CHEMBL565322
TypeSmall organic molecule
Emp. Form.C25H28F3N5O2
Mol. Mass.487.5173
SMILESCn1nccc1-c1cc(NC(=O)Nc2cccc(c2)C(F)(F)F)ccc1OCCN1CCCCC1