Reaction Details
TargetProtein kinase C theta type
LigandBDBM50301679
Substrate/Competitorn/a
Meas. Tech.ChEMBL_600772 (CHEMBL1037484)
IC50 3±n/a nM
Citation Subrath, JWang, DWu, BNiu, CBoschelli, DHLee, JYang, XBrennan, AChaudhary, D C-5 Substituted heteroaryl 3-pyridinecarbonitriles as PKCtheta inhibitors: Part I. Bioorg Med Chem Lett19:5423-5 (2009) 
 
Protein kinase C theta type
Name:Protein kinase C theta type
Type:Serine/threonine-protein kinase
Mol. Mass.:81878.04
Organism:Homo sapiens (Human)
Description:Full-length human PKC theta (Panvera Catalog No. P2996).
Residue:706
BDBM50301679
NameBDBM50301679
Synonyms:4-(4-methyl-1H-indol-5-ylamino)-5-(3-((4-methylpiperazin-1-yl)methyl)phenyl)nicotinonitrile | CHEMBL585307
TypeSmall organic molecule
Emp. Form.C27H28N6
Mol. Mass.436.5514
SMILESCN1CCN(Cc2cccc(c2)-c2cncc(C#N)c2Nc2ccc3[nH]ccc3c2C)CC1