Reaction Details
TargetProtein kinase C theta type
LigandBDBM50301685
Substrate/Competitorn/a
Meas. Tech.ChEMBL_600772 (CHEMBL1037484)
IC50 4.9±n/a nM
Citation Subrath, JWang, DWu, BNiu, CBoschelli, DHLee, JYang, XBrennan, AChaudhary, D C-5 Substituted heteroaryl 3-pyridinecarbonitriles as PKCtheta inhibitors: Part I. Bioorg Med Chem Lett19:5423-5 (2009) 
 
Protein kinase C theta type
Name:Protein kinase C theta type
Type:Serine/threonine-protein kinase
Mol. Mass.:81878.04
Organism:Homo sapiens (Human)
Description:Full-length human PKC theta (Panvera Catalog No. P2996).
Residue:706
BDBM50301685
NameBDBM50301685
Synonyms:1-((4-(3-ethynyl-2-((4-methyl-1H-inden-5-yl)methyl)phenyl)thiophen-2-yl)methyl)-4-methylpiperazine | CHEMBL567082
TypeSmall organic molecule
Emp. Form.C29H30N2S
Mol. Mass.438.627
SMILESCN1CCN(Cc2cc(cs2)-c2cccc(C#C)c2Cc2ccc3CC=Cc3c2C)CC1