Reaction Details
TargetProtein kinase C theta type
LigandBDBM50301689
Substrate/Competitorn/a
Meas. Tech.ChEMBL_600772 (CHEMBL1037484)
IC50 7.5±n/a nM
Citation Subrath, JWang, DWu, BNiu, CBoschelli, DHLee, JYang, XBrennan, AChaudhary, D C-5 Substituted heteroaryl 3-pyridinecarbonitriles as PKCtheta inhibitors: Part I. Bioorg Med Chem Lett19:5423-5 (2009) 
 
Protein kinase C theta type
Name:Protein kinase C theta type
Type:Serine/threonine-protein kinase
Mol. Mass.:81878.04
Organism:Homo sapiens (Human)
Description:Full-length human PKC theta (Panvera Catalog No. P2996).
Residue:706
BDBM50301689
NameBDBM50301689
Synonyms:4-(4-methyl-1H-indol-5-ylamino)-5-(5-(thiomorpholinomethyl)furan-2-yl)nicotinonitrile | CHEMBL585323
TypeSmall organic molecule
Emp. Form.C24H23N5OS
Mol. Mass.429.537
SMILESCc1c(Nc2c(cncc2-c2ccc(CN3CCSCC3)o2)C#N)ccc2[nH]ccc12