Reaction Details
TargetProtein kinase C theta type
LigandBDBM50301691
Substrate/Competitorn/a
Meas. Tech.ChEMBL_600772 (CHEMBL1037484)
IC50 35±n/a nM
Citation Subrath, JWang, DWu, BNiu, CBoschelli, DHLee, JYang, XBrennan, AChaudhary, D C-5 Substituted heteroaryl 3-pyridinecarbonitriles as PKCtheta inhibitors: Part I. Bioorg Med Chem Lett19:5423-5 (2009) 
 
Protein kinase C theta type
Name:Protein kinase C theta type
Type:Serine/threonine-protein kinase
Mol. Mass.:81878.04
Organism:Homo sapiens (Human)
Description:Full-length human PKC theta (Panvera Catalog No. P2996).
Residue:706
BDBM50301691
NameBDBM50301691
Synonyms:4-(4-methyl-1H-indol-5-ylamino)-5-(5-(pyrrolidin-1-ylmethyl)furan-2-yl)nicotinonitrile | CHEMBL567094
TypeSmall organic molecule
Emp. Form.C24H23N5O
Mol. Mass.397.4723
SMILESCc1c(Nc2c(cncc2-c2ccc(CN3CCCC3)o2)C#N)ccc2[nH]ccc12