Reaction Details
TargetDual specificity mitogen-activated protein kinase kinase 2
LigandBDBM50301963
Substrate/Competitorn/a
Meas. Tech.ChEMBL_598693 (CHEMBL1050774)
Ki 2400±n/a nM
Citation Wood, MRSchirripa, KMKim, JJQuigley, AGStump, CABell, IMBednar, RAFay, JFBruno, JGMoore, ELMosser, SDRoller, SSalvatore, CAKane, SAVacca, JPSelnick, HG Novel CGRP receptor antagonists through a design strategy of target simplification with addition of molecular flexibility. Bioorg Med Chem Lett19:5787-90 (2009) 
 
Dual specificity mitogen-activated protein kinase kinase 2
Name:Dual specificity mitogen-activated protein kinase kinase 2
Type:Enzyme Catalytic Domain
Mol. Mass.:44423.61
Organism:Homo sapiens (Human)
Description:gi_13489054
Residue:400
BDBM50301963
NameBDBM50301963
Synonyms:(S)-N-(3,5-difluorobenzyl)-N-(2-(3-methyl-2,5-dioxo-1',3'-dihydrospiro[imidazolidine-4,2'-indene]-5'-ylamino)-2-oxoethyl)pivalamide | CHEMBL569340
TypeSmall organic molecule
Emp. Form.C26H28F2N4O4
Mol. Mass.498.5217
SMILESCN1C(=O)NC(=O)[C@@]11Cc2ccc(NC(=O)CN(Cc3cc(F)cc(F)c3)C(=O)C(C)(C)C)cc2C1