Reaction Details
TargetDual specificity mitogen-activated protein kinase kinase 2
LigandBDBM50301967
Substrate/Competitorn/a
Meas. Tech.ChEMBL_598693 (CHEMBL1050774)
Ki 670±n/a nM
Citation Wood, MRSchirripa, KMKim, JJQuigley, AGStump, CABell, IMBednar, RAFay, JFBruno, JGMoore, ELMosser, SDRoller, SSalvatore, CAKane, SAVacca, JPSelnick, HG Novel CGRP receptor antagonists through a design strategy of target simplification with addition of molecular flexibility. Bioorg Med Chem Lett19:5787-90 (2009) 
 
Dual specificity mitogen-activated protein kinase kinase 2
Name:Dual specificity mitogen-activated protein kinase kinase 2
Type:Enzyme Catalytic Domain
Mol. Mass.:44423.61
Organism:Homo sapiens (Human)
Description:gi_13489054
Residue:400
BDBM50301967
NameBDBM50301967
Synonyms:CHEMBL583679 | N-(2-((S)-3-methyl-2,5-dioxo-1',3'-dihydrospiro[imidazolidine-4,2'-indene]-5'-ylamino)-2-oxoethyl)-N-((R)-1-phenylethyl)pivalamide
TypeSmall organic molecule
Emp. Form.C27H32N4O4
Mol. Mass.476.5674
SMILESC[C@@H](N(CC(=O)Nc1ccc2C[C@@]3(Cc2c1)N(C)C(=O)NC3=O)C(=O)C(C)(C)C)c1ccccc1