Reaction Details
TargetUrotensin-2 receptor
LigandBDBM50302255
Substrate/Competitorn/a
Meas. Tech.ChEMBL_596665 (CHEMBL1048827)
IC50 14±n/a nM
Citation Lawson, ECLuci, DKGhosh, SKinney, WAReynolds, CHQi, JSmith, CEWang, YMinor, LKHaertlein, BJParry, TJDamiano, BPMaryanoff, BE Nonpeptide urotensin-II receptor antagonists: a new ligand class based on piperazino-phthalimide and piperazino-isoindolinone subunits. J Med Chem52:7432-45 (2009) 
 
Urotensin-2 receptor
Name:Urotensin-2 receptor
Type:Enzyme Catalytic Domain
Mol. Mass.:42725.34
Organism:RAT
Description:Urotensin-II UTS2R RAT::P49684
Residue:386
BDBM50302255
NameBDBM50302255
Synonyms:CHEMBL565395 | N-((R)-4-(3,4-dimethoxyphenyl)-4-(1,3-dioxo-4-(4-((R)-1-phenylethyl)piperazin-1-yl)isoindolin-2-yl)butyl)-1,2-dimethyl-1H-imidazole-4-sulfonamide
TypeSmall organic molecule
Emp. Form.C37H44N6O6S
Mol. Mass.700.847
SMILESCOc1ccc(cc1OC)[C@@H](CCCNS(=O)(=O)c1cn(C)c(C)n1)N1C(=O)c2cccc(N3CCN(CC3)[C@H](C)c3ccccc3)c2C1=O