Reaction Details
TargetUrotensin-2 receptor
LigandBDBM50302262
Substrate/Competitorn/a
Meas. Tech.ChEMBL_596665 (CHEMBL1048827)
IC50 39±n/a nM
Citation Lawson, ECLuci, DKGhosh, SKinney, WAReynolds, CHQi, JSmith, CEWang, YMinor, LKHaertlein, BJParry, TJDamiano, BPMaryanoff, BE Nonpeptide urotensin-II receptor antagonists: a new ligand class based on piperazino-phthalimide and piperazino-isoindolinone subunits. J Med Chem52:7432-45 (2009) 
 
Urotensin-2 receptor
Name:Urotensin-2 receptor
Type:Enzyme Catalytic Domain
Mol. Mass.:42725.34
Organism:RAT
Description:Urotensin-II UTS2R RAT::P49684
Residue:386
BDBM50302262
NameBDBM50302262
Synonyms:(R)-N-(4-(3,4-dimethoxyphenyl)-4-(1-oxo-4-(piperazin-1-yl)isoindolin-2-yl)butyl)-N-methylthiophene-2-sulfonamide | CHEMBL565416
TypeSmall organic molecule
Emp. Form.C29H36N4O5S2
Mol. Mass.584.75
SMILESCOc1ccc(cc1OC)[C@@H](CCCN(C)S(=O)(=O)c1cccs1)N1Cc2c(cccc2N2CCNCC2)C1=O