Reaction Details
TargetUrotensin-2 receptor
LigandBDBM50302267
Substrate/Competitorn/a
Meas. Tech.ChEMBL_596665 (CHEMBL1048827)
IC50 16±n/a nM
Citation Lawson, ECLuci, DKGhosh, SKinney, WAReynolds, CHQi, JSmith, CEWang, YMinor, LKHaertlein, BJParry, TJDamiano, BPMaryanoff, BE Nonpeptide urotensin-II receptor antagonists: a new ligand class based on piperazino-phthalimide and piperazino-isoindolinone subunits. J Med Chem52:7432-45 (2009) 
 
Urotensin-2 receptor
Name:Urotensin-2 receptor
Type:Enzyme Catalytic Domain
Mol. Mass.:42725.34
Organism:RAT
Description:Urotensin-II UTS2R RAT::P49684
Residue:386
BDBM50302267
NameBDBM50302267
Synonyms:(R)-N-(4-(3,4-dimethoxyphenyl)-4-(4-(4-ethylpiperazin-1-yl)-1-oxoisoindolin-2-yl)butyl)-3,5-dimethyl-1H-pyrazole-4-carboxamide | CHEMBL578205
TypeSmall organic molecule
Emp. Form.C32H42N6O4
Mol. Mass.574.7137
SMILESCCN1CCN(CC1)c1cccc2C(=O)N(Cc12)[C@H](CCCNC(=O)c1c(C)n[nH]c1C)c1ccc(OC)c(OC)c1