Reaction Details
TargetUrotensin-2 receptor
LigandBDBM50302232
Substrate/Competitorn/a
Meas. Tech.ChEMBL_596666 (CHEMBL1048828)
Ki 160±n/a nM
Citation Lawson, ECLuci, DKGhosh, SKinney, WAReynolds, CHQi, JSmith, CEWang, YMinor, LKHaertlein, BJParry, TJDamiano, BPMaryanoff, BE Nonpeptide urotensin-II receptor antagonists: a new ligand class based on piperazino-phthalimide and piperazino-isoindolinone subunits. J Med Chem52:7432-45 (2009) 
 
Urotensin-2 receptor
Name:Urotensin-2 receptor
Type:Enzyme Catalytic Domain
Mol. Mass.:42159.71
Organism:Homo sapiens (Human)
Description:Urotensin-II UTS2R HUMAN::Q9UKP6
Residue:389
BDBM50302232
NameBDBM50302232
Synonyms:2-((S)-1-(3,4-dimethoxyphenyl)ethyl)-4-(4-((R)-1-phenylethyl)piperazin-1-yl)isoindoline-1,3-dione | CHEMBL577518
TypeSmall organic molecule
Emp. Form.C30H33N3O4
Mol. Mass.499.6007
SMILESCOc1ccc(cc1OC)[C@H](C)N1C(=O)c2cccc(N3CCN(CC3)[C@H](C)c3ccccc3)c2C1=O