Reaction Details
TargetUrotensin-2 receptor
LigandBDBM50302235
Substrate/Competitorn/a
Meas. Tech.ChEMBL_596666 (CHEMBL1048828)
Ki 430±n/a nM
Citation Lawson, ECLuci, DKGhosh, SKinney, WAReynolds, CHQi, JSmith, CEWang, YMinor, LKHaertlein, BJParry, TJDamiano, BPMaryanoff, BE Nonpeptide urotensin-II receptor antagonists: a new ligand class based on piperazino-phthalimide and piperazino-isoindolinone subunits. J Med Chem52:7432-45 (2009) 
 
Urotensin-2 receptor
Name:Urotensin-2 receptor
Type:Enzyme Catalytic Domain
Mol. Mass.:42159.71
Organism:Homo sapiens (Human)
Description:Urotensin-II UTS2R HUMAN::Q9UKP6
Residue:389
BDBM50302235
NameBDBM50302235
Synonyms:CHEMBL567866 | tert-butyl 2-(3,4-dimethoxyphenyl)-2-(1,3-dioxo-4-(4-((S)-1-phenylethyl)piperazin-1-yl)isoindolin-2-yl)ethylcarbamate
TypeSmall organic molecule
Emp. Form.C35H42N4O6
Mol. Mass.614.7312
SMILESCOc1ccc(cc1OC)C(CNC(=O)OC(C)(C)C)N1C(=O)c2cccc(N3CCN(CC3)[C@@H](C)c3ccccc3)c2C1=O