Reaction Details
TargetUrotensin-2 receptor
LigandBDBM50302266
Substrate/Competitorn/a
Meas. Tech.ChEMBL_596666 (CHEMBL1048828)
Ki 44±n/a nM
Citation Lawson, ECLuci, DKGhosh, SKinney, WAReynolds, CHQi, JSmith, CEWang, YMinor, LKHaertlein, BJParry, TJDamiano, BPMaryanoff, BE Nonpeptide urotensin-II receptor antagonists: a new ligand class based on piperazino-phthalimide and piperazino-isoindolinone subunits. J Med Chem52:7432-45 (2009) 
 
Urotensin-2 receptor
Name:Urotensin-2 receptor
Type:Enzyme Catalytic Domain
Mol. Mass.:42159.71
Organism:Homo sapiens (Human)
Description:Urotensin-II UTS2R HUMAN::Q9UKP6
Residue:389
BDBM50302266
NameBDBM50302266
Synonyms:(R)-N-(4-(4-(4-cyclobutylpiperazin-1-yl)-1-oxoisoindolin-2-yl)-4-(3,4-dimethoxyphenyl)butyl)-N-methylthiophene-2-sulfonamide | CHEMBL571537
TypeSmall organic molecule
Emp. Form.C33H42N4O5S2
Mol. Mass.638.84
SMILESCOc1ccc(cc1OC)[C@@H](CCCN(C)S(=O)(=O)c1cccs1)N1Cc2c(cccc2N2CCN(CC2)C2CCC2)C1=O