Reaction Details
TargetCannabinoid receptor 2
LigandBDBM50302295
Substrate/Competitorn/a
Meas. Tech.ChEMBL_596700 (CHEMBL1049670)
Ki 7.9±n/a nM
Citation Chu, GHSaeui, CTWorm, KWeaver, DGGoodman, AJBroadrup, RLCassel, JADeHaven, RNLaBuda, CJKoblish, MBrogdon, BSmith, SLe Bourdonnec, BDolle, RE Novel pyridine derivatives as potent and selective CB2 cannabinoid receptor agonists. Bioorg Med Chem Lett19:5931-5 (2009) 
 
Cannabinoid receptor 2
Name:Cannabinoid receptor 2
Type:G Protein-Coupled Receptor (GPCR)
Mol. Mass.:39690.94
Organism:Homo sapiens (Human)
Description:P34972
Residue:360
BDBM50302295
NameBDBM50302295
Synonyms:CHEMBL570792 | N-(5-ethyl-4-(morpholinomethyl)pyridin-2-yl)-2,2-dimethylbutanamide
TypeSmall organic molecule
Emp. Form.C18H29N3O2
Mol. Mass.319.4418
SMILESCCc1cnc(NC(=O)C(C)(C)CC)cc1CN1CCOCC1