Reaction Details
TargetCannabinoid receptor 2
LigandBDBM50302297
Substrate/Competitorn/a
Meas. Tech.ChEMBL_596700 (CHEMBL1049670)
Ki 870±n/a nM
Citation Chu, GHSaeui, CTWorm, KWeaver, DGGoodman, AJBroadrup, RLCassel, JADeHaven, RNLaBuda, CJKoblish, MBrogdon, BSmith, SLe Bourdonnec, BDolle, RE Novel pyridine derivatives as potent and selective CB2 cannabinoid receptor agonists. Bioorg Med Chem Lett19:5931-5 (2009) 
 
Cannabinoid receptor 2
Name:Cannabinoid receptor 2
Type:G Protein-Coupled Receptor (GPCR)
Mol. Mass.:39690.94
Organism:Homo sapiens (Human)
Description:P34972
Residue:360
BDBM50302297
NameBDBM50302297
Synonyms:CHEMBL572328 | N-(5-amino-4-(morpholinomethyl)pyridin-2-yl)-2,2-dimethylbutanamide
TypeSmall organic molecule
Emp. Form.C16H26N4O2
Mol. Mass.306.4032
SMILESCCC(C)(C)C(=O)Nc1cc(CN2CCOCC2)c(N)cn1