Reaction Details
TargetCannabinoid receptor 2
LigandBDBM50302304
Substrate/Competitorn/a
Meas. Tech.ChEMBL_596703 (CHEMBL1049673)
EC50 2.8±n/a nM
Citation Chu, GHSaeui, CTWorm, KWeaver, DGGoodman, AJBroadrup, RLCassel, JADeHaven, RNLaBuda, CJKoblish, MBrogdon, BSmith, SLe Bourdonnec, BDolle, RE Novel pyridine derivatives as potent and selective CB2 cannabinoid receptor agonists. Bioorg Med Chem Lett19:5931-5 (2009) 
 
Cannabinoid receptor 2
Name:Cannabinoid receptor 2
Type:Enzyme
Mol. Mass.:39366.68
Organism:Rattus norvegicus (Rat)
Description:Q9QZN9
Residue:360
BDBM50302304
NameBDBM50302304
Synonyms:1,2-dimethyl-N-(5-methyl-4-(morpholinomethyl)pyridin-2-yl)cyclohexanecarboxamide | CHEMBL568564
TypeSmall organic molecule
Emp. Form.C20H31N3O2
Mol. Mass.345.479
SMILESCC1CCCCC1(C)C(=O)Nc1cc(CN2CCOCC2)c(C)cn1