Reaction Details
TargetP2Y purinoceptor 12
LigandBDBM50302431
Substrate/Competitorn/a
Meas. Tech.ChEMBL_597609 (CHEMBL1050572)
Ki 660±n/a nM
Citation Kortum, SWLachance, RMSchweitzer, BAYalamanchili, GRahman, HEnnis, MDHuff, RMTenBrink, RE Thienopyrimidine-based P2Y12 platelet aggregation inhibitors. Bioorg Med Chem Lett19:5919-23 (2009) 
 
P2Y purinoceptor 12
Name:P2Y purinoceptor 12
Type:Enzyme
Mol. Mass.:39458.48
Organism:Homo sapiens (Human)
Description:Q9H244
Residue:342
BDBM50302431
NameBDBM50302431
Synonyms:1-(4-(6-ethylthieno[2,3-d]pyrimidin-4-yl)piperazin-1-yl)-2-phenylethanone | CHEMBL577508
TypeSmall organic molecule
Emp. Form.C20H22N4OS
Mol. Mass.366.48
SMILESCCc1cc2c(ncnc2s1)N1CCN(CC1)C(=O)Cc1ccccc1