Reaction Details
TargetP2Y purinoceptor 12
LigandBDBM50302447
Substrate/Competitorn/a
Meas. Tech.ChEMBL_597610 (CHEMBL1050573)
Ki 231±n/a nM
Citation Kortum, SWLachance, RMSchweitzer, BAYalamanchili, GRahman, HEnnis, MDHuff, RMTenBrink, RE Thienopyrimidine-based P2Y12 platelet aggregation inhibitors. Bioorg Med Chem Lett19:5919-23 (2009) 
 
P2Y purinoceptor 12
Name:P2Y purinoceptor 12
Type:Enzyme
Mol. Mass.:39458.48
Organism:Homo sapiens (Human)
Description:Q9H244
Residue:342
BDBM50302447
NameBDBM50302447
Synonyms:3-(3-(6-ethyl-4-(4-(2-phenylacetyl)piperazin-1-yl)thieno[2,3-d]pyrimidin-2-yl)ureido)propanoic acid | CHEMBL567913
TypeSmall organic molecule
Emp. Form.C24H28N6O4S
Mol. Mass.496.582
SMILESCCc1cc2c(nc(NC(=O)NCCC(O)=O)nc2s1)N1CCN(CC1)C(=O)Cc1ccccc1