Reaction Details
TargetP2Y purinoceptor 12
LigandBDBM50302455
Substrate/Competitorn/a
Meas. Tech.ChEMBL_597610 (CHEMBL1050573)
Ki 1810±n/a nM
Citation Kortum, SWLachance, RMSchweitzer, BAYalamanchili, GRahman, HEnnis, MDHuff, RMTenBrink, RE Thienopyrimidine-based P2Y12 platelet aggregation inhibitors. Bioorg Med Chem Lett19:5919-23 (2009) 
 
P2Y purinoceptor 12
Name:P2Y purinoceptor 12
Type:Enzyme
Mol. Mass.:39458.48
Organism:Homo sapiens (Human)
Description:Q9H244
Residue:342
BDBM50302455
NameBDBM50302455
Synonyms:1-(4-(4-(4-(biphenylcarbonyl)piperazin-1-yl)-6-ethylthieno[2,3-d]pyrimidin-2-yl)piperazin-1-yl)-2,2,2-trifluoroethanone | CHEMBL568772
TypeSmall organic molecule
Emp. Form.C31H31F3N6O2S
Mol. Mass.608.677
SMILESCCc1cc2c(nc(nc2s1)N1CCN(CC1)C(=O)C(F)(F)F)N1CCN(CC1)C(=O)c1ccc(cc1)-c1ccccc1