Reaction Details
TargetP2Y purinoceptor 12
LigandBDBM50302459
Substrate/Competitorn/a
Meas. Tech.ChEMBL_597610 (CHEMBL1050573)
Ki 75±n/a nM
Citation Kortum, SWLachance, RMSchweitzer, BAYalamanchili, GRahman, HEnnis, MDHuff, RMTenBrink, RE Thienopyrimidine-based P2Y12 platelet aggregation inhibitors. Bioorg Med Chem Lett19:5919-23 (2009) 
 
P2Y purinoceptor 12
Name:P2Y purinoceptor 12
Type:Enzyme
Mol. Mass.:39458.48
Organism:Homo sapiens (Human)
Description:Q9H244
Residue:342
BDBM50302459
NameBDBM50302459
Synonyms:(R)-biphenyl-4-yl(4-(2-(2,3-dihydroxypropylamino)-6-ethylthieno[2,3-d]pyrimidin-4-yl)piperazin-1-yl)methanone | CHEMBL568148
TypeSmall organic molecule
Emp. Form.C28H31N5O3S
Mol. Mass.517.642
SMILESCCc1cc2c(nc(NC[C@@H](O)CO)nc2s1)N1CCN(CC1)C(=O)c1ccc(cc1)-c1ccccc1