Reaction Details
TargetP2Y purinoceptor 12
LigandBDBM50302450
Substrate/Competitorn/a
Meas. Tech.ChEMBL_597609 (CHEMBL1050572)
Ki 78±n/a nM
Citation Kortum, SWLachance, RMSchweitzer, BAYalamanchili, GRahman, HEnnis, MDHuff, RMTenBrink, RE Thienopyrimidine-based P2Y12 platelet aggregation inhibitors. Bioorg Med Chem Lett19:5919-23 (2009) 
 
P2Y purinoceptor 12
Name:P2Y purinoceptor 12
Type:Enzyme
Mol. Mass.:39458.48
Organism:Homo sapiens (Human)
Description:Q9H244
Residue:342
BDBM50302450
NameBDBM50302450
Synonyms:CHEMBL585317 | biphenyl-4-yl(4-(6-ethyl-2-(3-hydroxypropylamino)thieno[2,3-d]pyrimidin-4-yl)piperazin-1-yl)methanone
TypeSmall organic molecule
Emp. Form.C28H31N5O2S
Mol. Mass.501.643
SMILESCCc1cc2c(nc(NCCCO)nc2s1)N1CCN(CC1)C(=O)c1ccc(cc1)-c1ccccc1