Reaction Details
TargetP2Y purinoceptor 12
LigandBDBM50302630
Substrate/Competitorn/a
Meas. Tech.ChEMBL_595037 (CHEMBL1042522)
IC50 660±n/a nM
Citation Parlow, JJBurney, MWCase, BLGirard, TJHall, KAHiebsch, RRHuff, RMLachance, RMMischke, DARapp, SRWoerndle, RSEnnis, MD Piperazinyl-glutamate-pyrimidines as potent P2Y12 antagonists for inhibition of platelet aggregation. Bioorg Med Chem Lett19:6148-56 (2009) 
 
P2Y purinoceptor 12
Name:P2Y purinoceptor 12
Type:Enzyme
Mol. Mass.:39458.48
Organism:Homo sapiens (Human)
Description:Q9H244
Residue:342
BDBM50302630
NameBDBM50302630
Synonyms:(S)-5-(4-(butoxycarbonyl)piperazin-1-yl)-5-oxo-4-(2-phenyl-6-(4-(pyrrolidin-1-yl)piperidin-1-yl)pyrimidine-4-carboxamido)pentanoic acid | CHEMBL570064
TypeSmall organic molecule
Emp. Form.C34H47N7O6
Mol. Mass.649.7803
SMILESCCCCOC(=O)N1CCN(CC1)C(=O)[C@H](CCC(O)=O)NC(=O)c1cc(nc(n1)-c1ccccc1)N1CCC(CC1)N1CCCC1