Reaction Details
TargetP2Y purinoceptor 12
LigandBDBM50302721
Substrate/Competitorn/a
Meas. Tech.ChEMBL_595037 (CHEMBL1042522)
IC50 620±n/a nM
Citation Parlow, JJBurney, MWCase, BLGirard, TJHall, KAHiebsch, RRHuff, RMLachance, RMMischke, DARapp, SRWoerndle, RSEnnis, MD Piperazinyl-glutamate-pyrimidines as potent P2Y12 antagonists for inhibition of platelet aggregation. Bioorg Med Chem Lett19:6148-56 (2009) 
 
P2Y purinoceptor 12
Name:P2Y purinoceptor 12
Type:Enzyme
Mol. Mass.:39458.48
Organism:Homo sapiens (Human)
Description:Q9H244
Residue:342
BDBM50302721
NameBDBM50302721
Synonyms:(S)-4-(6-(4-(2-aminoethyl)piperidin-1-yl)-2-phenylpyrimidine-4-carboxamido)-5-oxo-5-(4-(pentyloxycarbonyl)piperazin-1-yl)pentanoic acid | CHEMBL570154
TypeSmall organic molecule
Emp. Form.C33H47N7O6
Mol. Mass.637.7696
SMILESCCCCCOC(=O)N1CCN(CC1)C(=O)[C@H](CCC(O)=O)NC(=O)c1cc(nc(n1)-c1ccccc1)N1CCC(CCN)CC1