Reaction Details
TargetDelta-type opioid receptor
LigandBDBM50302761
Substrate/Competitorn/a
Meas. Tech.ChEMBL_595271 (CHEMBL1043623)
EC50 2.6±n/a nM
Citation Jones, PGriffin, AMGawell, LLavoie, RDelorme, DRoberts, EBrown, WWalpole, CXiao, WBoulet, JLabarre, MCoupal, MButterworth, JSt-Onge, SHodzic, LSalois, D N,N-Diethyl-4-[(3-hydroxyphenyl)(piperidin-4-yl)amino] benzamide derivatives: the development of diaryl amino piperidines as potent delta opioid receptor agonists with in vivo anti-nociceptive activity in rodent models. Bioorg Med Chem Lett19:5994-8 (2009) 
 
Delta-type opioid receptor
Name:Delta-type opioid receptor
Type:G Protein-Coupled Receptor (GPCR)
Mol. Mass.:40382.98
Organism:Homo sapiens (Human)
Description:Competition binding assays were carried out using membrane preparations from transfected HN9.10 cells that constitutively expressed the delta opioid receptor.
Residue:372
BDBM50302761
NameBDBM50302761
Synonyms:CHEMBL569006 | N,N-diethyl-4-((1-(3-fluorophenethyl)piperidin-4-yl)(3-hydroxyphenyl)amino)benzamide
TypeSmall organic molecule
Emp. Form.C30H36FN3O2
Mol. Mass.489.6241
SMILESCCN(CC)C(=O)c1ccc(cc1)N(C1CCN(CCc2cccc(F)c2)CC1)c1cccc(O)c1