Reaction Details
TargetMu-type opioid receptor
LigandBDBM50302767
Substrate/Competitorn/a
Meas. Tech.ChEMBL_595267 (CHEMBL1043619)
Ki 289±n/a nM
Citation Jones, PGriffin, AMGawell, LLavoie, RDelorme, DRoberts, EBrown, WWalpole, CXiao, WBoulet, JLabarre, MCoupal, MButterworth, JSt-Onge, SHodzic, LSalois, D N,N-Diethyl-4-[(3-hydroxyphenyl)(piperidin-4-yl)amino] benzamide derivatives: the development of diaryl amino piperidines as potent delta opioid receptor agonists with in vivo anti-nociceptive activity in rodent models. Bioorg Med Chem Lett19:5994-8 (2009) 
 
Mu-type opioid receptor
Name:Mu-type opioid receptor
Type:G Protein-Coupled Receptor (GPCR)
Mol. Mass.:44789.51
Organism:Homo sapiens (Human)
Description:P35372
Residue:400
BDBM50302767
NameBDBM50302767
Synonyms:4-((1-(2-cyclohexylethyl)piperidin-4-yl)(3-hydroxyphenyl)amino)-N,N-diethylbenzamide | CHEMBL570233
TypeSmall organic molecule
Emp. Form.C30H43N3O2
Mol. Mass.477.6813
SMILESCCN(CC)C(=O)c1ccc(cc1)N(C1CCN(CCC2CCCCC2)CC1)c1cccc(O)c1