Reaction Details
TargetKappa-type opioid receptor
LigandBDBM50302774
Substrate/Competitorn/a
Meas. Tech.ChEMBL_595268 (CHEMBL1043620)
Ki 2549±n/a nM
Citation Jones, PGriffin, AMGawell, LLavoie, RDelorme, DRoberts, EBrown, WWalpole, CXiao, WBoulet, JLabarre, MCoupal, MButterworth, JSt-Onge, SHodzic, LSalois, D N,N-Diethyl-4-[(3-hydroxyphenyl)(piperidin-4-yl)amino] benzamide derivatives: the development of diaryl amino piperidines as potent delta opioid receptor agonists with in vivo anti-nociceptive activity in rodent models. Bioorg Med Chem Lett19:5994-8 (2009) 
 
Kappa-type opioid receptor
Name:Kappa-type opioid receptor
Type:G Protein-Coupled Receptor (GPCR)
Mol. Mass.:42648.76
Organism:Homo sapiens (Human)
Description:P41145
Residue:380
BDBM50302774
NameBDBM50302774
Synonyms:CHEMBL569945 | N,N-diethyl-4-((3-methoxyphenyl)(1-(2-(thiophen-3-yl)ethyl)piperidin-4-yl)amino)benzamide
TypeSmall organic molecule
Emp. Form.C29H37N3O2S
Mol. Mass.491.688
SMILESCCN(CC)C(=O)c1ccc(cc1)N(C1CCN(CCc2ccsc2)CC1)c1cccc(OC)c1