Reaction Details
TargetCalcitonin gene-related peptide type 1 receptor
LigandBDBM50302894
Substrate/Competitorn/a
Meas. Tech.ChEMBL_595485 (CHEMBL1046104)
Ki 1249±n/a nM
Citation Burgey, CSPotteiger, CMDeng, JZMosser, SDSalvatore, CAYu, SRoller, SKane, SAVacca, JPWilliams, TM Optimization of azepanone calcitonin gene-related peptide (CGRP) receptor antagonists: development of novel spiropiperidines. Bioorg Med Chem Lett19:6368-72 (2009) 
 
Calcitonin gene-related peptide type 1 receptor
Name:Calcitonin gene-related peptide type 1 receptor
Type:Enzyme Catalytic Domain
Mol. Mass.:52980.45
Organism:Homo sapiens (Human)
Description:Q16602
Residue:461
BDBM50302894
NameBDBM50302894
Synonyms:CHEMBL584311 | N-((3R,6S)-6-(2,3-difluorophenyl)-2-oxo-1-(2,2,2-trifluoroethyl)azepan-3-yl)-2'-oxo-2',4'-dihydro-1'H-spiro[piperidine-4,3'-quinoline]-1-carboxamide
TypeSmall organic molecule
Emp. Form.C28H29F5N4O3
Mol. Mass.564.5469
SMILESFc1cccc([C@@H]2CC[C@@H](NC(=O)N3CCC4(CC3)Cc3ccccc3NC4=O)C(=O)N(CC(F)(F)F)C2)c1F