Reaction Details
TargetDual specificity protein kinase CLK4
LigandBDBM50302979
Substrate/Competitorn/a
Meas. Tech.ChEMBL_596744 (CHEMBL1039032)
IC50 1000±n/a nM
Citation Mott, BTTanega, CShen, MMaloney, DJShinn, PLeister, WMarugan, JJInglese, JAustin, CPMisteli, TAuld, DSThomas, CJ Evaluation of substituted 6-arylquinazolin-4-amines as potent and selective inhibitors of cdc2-like kinases (Clk). Bioorg Med Chem Lett19:6700-5 (2009) 
 
Dual specificity protein kinase CLK4
Name:Dual specificity protein kinase CLK4
Type:Serine/threonine-protein kinase
Mol. Mass.:57522.53
Organism:Homo sapiens (Human)
Description:gi_10190706
Residue:481
BDBM50302979
NameBDBM50302979
Synonyms:6-(3-methoxyphenyl)-N-((4-methylthiophen-2-yl)methyl)quinazolin-4-amine | CHEMBL566501
TypeSmall organic molecule
Emp. Form.C21H19N3OS
Mol. Mass.361.46
SMILESCOc1cccc(c1)-c1ccc2ncnc(NCc3cc(C)cs3)c2c1