Reaction Details
TargetDual specificity protein kinase CLK4
LigandBDBM50302992
Substrate/Competitorn/a
Meas. Tech.ChEMBL_596744 (CHEMBL1039032)
IC50 794±n/a nM
Citation Mott, BTTanega, CShen, MMaloney, DJShinn, PLeister, WMarugan, JJInglese, JAustin, CPMisteli, TAuld, DSThomas, CJ Evaluation of substituted 6-arylquinazolin-4-amines as potent and selective inhibitors of cdc2-like kinases (Clk). Bioorg Med Chem Lett19:6700-5 (2009) 
 
Dual specificity protein kinase CLK4
Name:Dual specificity protein kinase CLK4
Type:Serine/threonine-protein kinase
Mol. Mass.:57522.53
Organism:Homo sapiens (Human)
Description:gi_10190706
Residue:481
BDBM50302992
NameBDBM50302992
Synonyms:6-(furan-2-yl)-N-(pyridin-3-ylmethyl)quinazolin-4-amine | CHEMBL568166
TypeSmall organic molecule
Emp. Form.C18H14N4O
Mol. Mass.302.33
SMILESC(Nc1ncnc2ccc(cc12)-c1ccco1)c1cccnc1