Reaction Details
TargetMitogen-activated protein kinase kinase kinase 19
LigandBDBM80396
Substrate/Competitorn/a
Meas. Tech.ChEMBL_596757 (CHEMBL1039045)
Kd 290±n/a nM
Citation Mott, BTTanega, CShen, MMaloney, DJShinn, PLeister, WMarugan, JJInglese, JAustin, CPMisteli, TAuld, DSThomas, CJ Evaluation of substituted 6-arylquinazolin-4-amines as potent and selective inhibitors of cdc2-like kinases (Clk). Bioorg Med Chem Lett19:6700-5 (2009) 
 
Mitogen-activated protein kinase kinase kinase 19
Name:Mitogen-activated protein kinase kinase kinase 19
Type:PROTEIN
Mol. Mass.:150549.39
Organism:Homo sapiens (Human)
Description:ChEMBL_774616
Residue:1328
BDBM80396
NameBDBM80396
Synonyms:(1E)-1-(3-ethyl-5-methoxy-1,3-benzothiazol-2-ylidene)-2-propanone (1E)-1-(3-ethyl-5-methoxy-1,3-benzothiazol-2-ylidene)propan-2-one MLS000518915 cid_1893667
TypeSmall organic molecule
Emp. Form.C13H15NO2S
Mol. Mass.249.329
SMILESCCN1C(Sc2ccc(OC)cc12)=CC(C)=O