Reaction Details
TargetTyrosine-protein kinase JAK2
LigandBDBM50303044
Substrate/Competitorn/a
Meas. Tech.ChEMBL_597274 (CHEMBL1043451)
IC50<3±n/a nM
Citation Ioannidis, SLamb, MLDavies, AMAlmeida, LSu, MBebernitz, GYe, MBell, KAlimzhanov, MZinda, M Discovery of pyrazol-3-ylamino pyrazines as novel JAK2 inhibitors. Bioorg Med Chem Lett19:6524-8 (2009) 
 
Tyrosine-protein kinase JAK2
Name:Tyrosine-protein kinase JAK2
Type:Protein
Mol. Mass.:130684.68
Organism:Homo sapiens (Human)
Description:O60674
Residue:1132
BDBM50303044
NameBDBM50303044
Synonyms:(S)-3-(1-(5-fluoropyridin-2-yl)ethylamino)-5-(5-methyl-1H-pyrazol-3-ylamino)pyrazine-2-carbonitrile | CHEMBL576257
TypeSmall organic molecule
Emp. Form.C16H15FN8
Mol. Mass.338.3423
SMILESC[C@H](Nc1nc(Nc2cc(C)n[nH]2)cnc1C#N)c1ccc(F)cn1