Reaction Details
TargetTyrosine-protein kinase JAK2
LigandBDBM50303052
Substrate/Competitorn/a
Meas. Tech.ChEMBL_597275 (CHEMBL1043452)
IC50 18±n/a nM
Citation Ioannidis, SLamb, MLDavies, AMAlmeida, LSu, MBebernitz, GYe, MBell, KAlimzhanov, MZinda, M Discovery of pyrazol-3-ylamino pyrazines as novel JAK2 inhibitors. Bioorg Med Chem Lett19:6524-8 (2009) 
 
Tyrosine-protein kinase JAK2
Name:Tyrosine-protein kinase JAK2
Type:Protein
Mol. Mass.:130684.68
Organism:Homo sapiens (Human)
Description:O60674
Residue:1132
BDBM50303052
NameBDBM50303052
Synonyms:(S)-N6-(1-(5-fluoropyridin-2-yl)ethyl)-3-methyl-N2-(5-methyl-1H-pyrazol-3-yl)pyrazine-2,6-diamine | CHEMBL576068
TypeSmall organic molecule
Emp. Form.C16H18FN7
Mol. Mass.327.3594
SMILESC[C@H](Nc1cnc(C)c(Nc2cc(C)n[nH]2)n1)c1ccc(F)cn1